KDE CI: Extragear » kio-gdrive » stable-kf5-qt5 SUSEQt5.12 - Build # 2 - Failure!

classic Classic list List threaded Threaded
3 messages Options
Reply | Threaded
Open this post in threaded view
|

KDE CI: Extragear » kio-gdrive » stable-kf5-qt5 SUSEQt5.12 - Build # 2 - Failure!

CI System
BUILD FAILURE
Build URL https://build.kde.org/job/Extragear/job/kio-gdrive/job/stable-kf5-qt5%20SUSEQt5.12/2/
Project: stable-kf5-qt5 SUSEQt5.12
Date of build: Thu, 08 Aug 2019 07:33:03 +0000
Build duration: 4 min 55 sec and counting

CONSOLE OUTPUT
[...truncated 721 lines...]
[2019-08-08T07:37:55.862Z] | ^~~~~~~~~~~
[2019-08-08T07:37:55.862Z] /home/jenkins/workspace/Extragear/kio-gdrive/stable-kf5-qt5 SUSEQt5.12/src/kio_gdrive.cpp:459:45: error: ���Labels��� is not a member of ���KGAPI2::Drive::FileFetchJob���
[2019-08-08T07:37:55.862Z] 459 | | FileFetchJob::Labels
[2019-08-08T07:37:55.862Z] | ^~~~~~
[2019-08-08T07:37:55.862Z] /home/jenkins/workspace/Extragear/kio-gdrive/stable-kf5-qt5 SUSEQt5.12/src/kio_gdrive.cpp:460:45: error: ���ExportLinks��� is not a member of ���KGAPI2::Drive::FileFetchJob���
[2019-08-08T07:37:55.862Z] 460 | | FileFetchJob::ExportLinks
[2019-08-08T07:37:55.862Z] | ^~~~~~~~~~~
[2019-08-08T07:37:55.862Z] /home/jenkins/workspace/Extragear/kio-gdrive/stable-kf5-qt5 SUSEQt5.12/src/kio_gdrive.cpp:461:45: error: ���LastViewedByMeDate��� is not a member of ���KGAPI2::Drive::FileFetchJob���
[2019-08-08T07:37:55.862Z] 461 | | FileFetchJob::LastViewedByMeDate);
[2019-08-08T07:37:55.862Z] | ^~~~~~~~~~~~~~~~~~
[2019-08-08T07:37:55.862Z] /home/jenkins/workspace/Extragear/kio-gdrive/stable-kf5-qt5 SUSEQt5.12/src/kio_gdrive.cpp:477:62: warning: ���void KIO::UDSEntry::insert(uint, const QString&)��� is deprecated [-Wdeprecated-declarations]
[2019-08-08T07:37:55.862Z] 477 | entry.insert(KIO::UDSEntry::UDS_NAME, QStringLiteral("."));
[2019-08-08T07:37:55.862Z] | ^
[2019-08-08T07:37:55.862Z] In file included from /home/jenkins/install-prefix/include/KF5/KIOCore/kio/slavebase.h:24,
[2019-08-08T07:37:55.862Z] from /home/jenkins/install-prefix/include/KF5/KIOCore/KIO/SlaveBase:1,
[2019-08-08T07:37:55.862Z] from /home/jenkins/workspace/Extragear/kio-gdrive/stable-kf5-qt5 SUSEQt5.12/src/kio_gdrive.h:27,
[2019-08-08T07:37:55.862Z] from /home/jenkins/workspace/Extragear/kio-gdrive/stable-kf5-qt5 SUSEQt5.12/src/kio_gdrive.cpp:20:
[2019-08-08T07:37:55.862Z] /home/jenkins/install-prefix/include/KF5/KIOCore/kio/udsentry.h:148:29: note: declared here
[2019-08-08T07:37:55.862Z] 148 | KIOCORE_DEPRECATED void insert(uint field, const QString &value);
[2019-08-08T07:37:55.862Z] | ^~~~~~
[2019-08-08T07:37:55.862Z] /home/jenkins/workspace/Extragear/kio-gdrive/stable-kf5-qt5 SUSEQt5.12/src/kio_gdrive.cpp:478:55: warning: ���void KIO::UDSEntry::insert(uint, long long int)��� is deprecated [-Wdeprecated-declarations]
[2019-08-08T07:37:55.862Z] 478 | entry.insert(KIO::UDSEntry::UDS_FILE_TYPE, S_IFDIR);
[2019-08-08T07:37:55.862Z] | ^
[2019-08-08T07:37:55.862Z] In file included from /home/jenkins/install-prefix/include/KF5/KIOCore/kio/slavebase.h:24,
[2019-08-08T07:37:55.862Z] from /home/jenkins/install-prefix/include/KF5/KIOCore/KIO/SlaveBase:1,
[2019-08-08T07:37:55.862Z] from /home/jenkins/workspace/Extragear/kio-gdrive/stable-kf5-qt5 SUSEQt5.12/src/kio_gdrive.h:27,
[2019-08-08T07:37:55.862Z] from /home/jenkins/workspace/Extragear/kio-gdrive/stable-kf5-qt5 SUSEQt5.12/src/kio_gdrive.cpp:20:
[2019-08-08T07:37:55.862Z] /home/jenkins/install-prefix/include/KF5/KIOCore/kio/udsentry.h:156:29: note: declared here
[2019-08-08T07:37:55.862Z] 156 | KIOCORE_DEPRECATED void insert(uint field, long long l);
[2019-08-08T07:37:55.862Z] | ^~~~~~
[2019-08-08T07:37:55.862Z] /home/jenkins/workspace/Extragear/kio-gdrive/stable-kf5-qt5 SUSEQt5.12/src/kio_gdrive.cpp:479:44: warning: ���void KIO::UDSEntry::insert(uint, long long int)��� is deprecated [-Wdeprecated-declarations]
[2019-08-08T07:37:55.862Z] 479 | entry.insert(KIO::UDSEntry::UDS_SIZE, 0);
[2019-08-08T07:37:55.862Z] | ^
[2019-08-08T07:37:55.862Z] In file included from /home/jenkins/install-prefix/include/KF5/KIOCore/kio/slavebase.h:24,
[2019-08-08T07:37:55.862Z] from /home/jenkins/install-prefix/include/KF5/KIOCore/KIO/SlaveBase:1,
[2019-08-08T07:37:55.862Z] from /home/jenkins/workspace/Extragear/kio-gdrive/stable-kf5-qt5 SUSEQt5.12/src/kio_gdrive.h:27,
[2019-08-08T07:37:55.862Z] from /home/jenkins/workspace/Extragear/kio-gdrive/stable-kf5-qt5 SUSEQt5.12/src/kio_gdrive.cpp:20:
[2019-08-08T07:37:55.862Z] /home/jenkins/install-prefix/include/KF5/KIOCore/kio/udsentry.h:156:29: note: declared here
[2019-08-08T07:37:55.862Z] 156 | KIOCORE_DEPRECATED void insert(uint field, long long l);
[2019-08-08T07:37:55.862Z] | ^~~~~~
[2019-08-08T07:37:55.862Z] /home/jenkins/workspace/Extragear/kio-gdrive/stable-kf5-qt5 SUSEQt5.12/src/kio_gdrive.cpp:480:122: warning: ���void KIO::UDSEntry::insert(uint, long long int)��� is deprecated [-Wdeprecated-declarations]
[2019-08-08T07:37:55.862Z] 480 | entry.insert(KIO::UDSEntry::UDS_ACCESS, S_IRUSR | S_IWUSR | S_IXUSR | S_IRGRP | S_IWGRP | S_IXGRP | S_IROTH | S_IXOTH);
[2019-08-08T07:37:55.862Z] | ^
[2019-08-08T07:37:55.862Z] In file included from /home/jenkins/install-prefix/include/KF5/KIOCore/kio/slavebase.h:24,
[2019-08-08T07:37:55.862Z] from /home/jenkins/install-prefix/include/KF5/KIOCore/KIO/SlaveBase:1,
[2019-08-08T07:37:55.862Z] from /home/jenkins/workspace/Extragear/kio-gdrive/stable-kf5-qt5 SUSEQt5.12/src/kio_gdrive.h:27,
[2019-08-08T07:37:55.862Z] from /home/jenkins/workspace/Extragear/kio-gdrive/stable-kf5-qt5 SUSEQt5.12/src/kio_gdrive.cpp:20:
[2019-08-08T07:37:55.862Z] /home/jenkins/install-prefix/include/KF5/KIOCore/kio/udsentry.h:156:29: note: declared here
[2019-08-08T07:37:55.862Z] 156 | KIOCORE_DEPRECATED void insert(uint field, long long l);
[2019-08-08T07:37:55.862Z] | ^~~~~~
[2019-08-08T07:37:55.862Z] /home/jenkins/workspace/Extragear/kio-gdrive/stable-kf5-qt5 SUSEQt5.12/src/kio_gdrive.cpp: In member function ���virtual void KIOGDrive::get(const QUrl&)���:
[2019-08-08T07:37:55.862Z] /home/jenkins/workspace/Extragear/kio-gdrive/stable-kf5-qt5 SUSEQt5.12/src/kio_gdrive.cpp:610:42: error: ���Id��� is not a member of ���KGAPI2::Drive::FileFetchJob���
[2019-08-08T07:37:55.862Z] 610 | fileFetchJob.setFields(FileFetchJob::Id
[2019-08-08T07:37:55.862Z] | ^~
[2019-08-08T07:37:55.862Z] /home/jenkins/workspace/Extragear/kio-gdrive/stable-kf5-qt5 SUSEQt5.12/src/kio_gdrive.cpp:611:45: error: ���MimeType��� is not a member of ���KGAPI2::Drive::FileFetchJob���
[2019-08-08T07:37:55.862Z] 611 | | FileFetchJob::MimeType
[2019-08-08T07:37:55.862Z] | ^~~~~~~~
[2019-08-08T07:37:55.862Z] /home/jenkins/workspace/Extragear/kio-gdrive/stable-kf5-qt5 SUSEQt5.12/src/kio_gdrive.cpp:612:45: error: ���ExportLinks��� is not a member of ���KGAPI2::Drive::FileFetchJob���
[2019-08-08T07:37:55.862Z] 612 | | FileFetchJob::ExportLinks
[2019-08-08T07:37:55.862Z] | ^~~~~~~~~~~
[2019-08-08T07:37:55.862Z] /home/jenkins/workspace/Extragear/kio-gdrive/stable-kf5-qt5 SUSEQt5.12/src/kio_gdrive.cpp:613:45: error: ���DownloadUrl��� is not a member of ���KGAPI2::Drive::FileFetchJob���
[2019-08-08T07:37:55.862Z] 613 | | FileFetchJob::DownloadUrl);
[2019-08-08T07:37:55.862Z] | ^~~~~~~~~~~
[2019-08-08T07:37:55.862Z] [ 90%] Linking CXX shared module gdrive.so
[2019-08-08T07:37:56.126Z] /home/jenkins/workspace/Extragear/kio-gdrive/stable-kf5-qt5 SUSEQt5.12/src/kio_gdrive.cpp: In member function ���virtual void KIOGDrive::copy(const QUrl&, const QUrl&, int, KIO::JobFlags)���:
[2019-08-08T07:37:56.126Z] /home/jenkins/workspace/Extragear/kio-gdrive/stable-kf5-qt5 SUSEQt5.12/src/kio_gdrive.cpp:869:48: error: ���Id��� is not a member of ���KGAPI2::Drive::FileFetchJob���
[2019-08-08T07:37:56.126Z] 869 | sourceFileFetchJob.setFields(FileFetchJob::Id | FileFetchJob::ModifiedDate |
[2019-08-08T07:37:56.126Z] | ^~
[2019-08-08T07:37:56.126Z] /home/jenkins/workspace/Extragear/kio-gdrive/stable-kf5-qt5 SUSEQt5.12/src/kio_gdrive.cpp:869:67: error: ���ModifiedDate��� is not a member of ���KGAPI2::Drive::FileFetchJob���
[2019-08-08T07:37:56.126Z] 869 | sourceFileFetchJob.setFields(FileFetchJob::Id | FileFetchJob::ModifiedDate |
[2019-08-08T07:37:56.126Z] | ^~~~~~~~~~~~
[2019-08-08T07:37:56.126Z] /home/jenkins/workspace/Extragear/kio-gdrive/stable-kf5-qt5 SUSEQt5.12/src/kio_gdrive.cpp:870:48: error: ���LastViewedByMeDate��� is not a member of ���KGAPI2::Drive::FileFetchJob���
[2019-08-08T07:37:56.126Z] 870 | FileFetchJob::LastViewedByMeDate | FileFetchJob::Description);
[2019-08-08T07:37:56.126Z] | ^~~~~~~~~~~~~~~~~~
[2019-08-08T07:37:56.126Z] /home/jenkins/workspace/Extragear/kio-gdrive/stable-kf5-qt5 SUSEQt5.12/src/kio_gdrive.cpp:870:83: error: ���Description��� is not a member of ���KGAPI2::Drive::FileFetchJob���
[2019-08-08T07:37:56.126Z] 870 | FileFetchJob::LastViewedByMeDate | FileFetchJob::Description);
[2019-08-08T07:37:56.126Z] | ^~~~~~~~~~~
[2019-08-08T07:37:56.126Z] /home/jenkins/workspace/Extragear/kio-gdrive/stable-kf5-qt5 SUSEQt5.12/src/kio_gdrive.cpp: In member function ���virtual void KIOGDrive::mimetype(const QUrl&)���:
[2019-08-08T07:37:56.126Z] /home/jenkins/workspace/Extragear/kio-gdrive/stable-kf5-qt5 SUSEQt5.12/src/kio_gdrive.cpp:1089:42: error: ���Id��� is not a member of ���KGAPI2::Drive::FileFetchJob���
[2019-08-08T07:37:56.126Z] 1089 | fileFetchJob.setFields(FileFetchJob::Id | FileFetchJob::MimeType);
[2019-08-08T07:37:56.126Z] | ^~
[2019-08-08T07:37:56.126Z] /home/jenkins/workspace/Extragear/kio-gdrive/stable-kf5-qt5 SUSEQt5.12/src/kio_gdrive.cpp:1089:61: error: ���MimeType��� is not a member of ���KGAPI2::Drive::FileFetchJob���
[2019-08-08T07:37:56.126Z] 1089 | fileFetchJob.setFields(FileFetchJob::Id | FileFetchJob::MimeType);
[2019-08-08T07:37:56.126Z] | ^~~~~~~~
[2019-08-08T07:37:56.717Z] [ 95%] Linking CXX executable urltest
[2019-08-08T07:37:56.717Z] make[2]: *** [src/CMakeFiles/kio_gdrive.dir/build.make:76: src/CMakeFiles/kio_gdrive.dir/kio_gdrive.cpp.o] Error 1
[2019-08-08T07:37:56.717Z] make[2]: *** Waiting for unfinished jobs....
[2019-08-08T07:37:56.717Z] [ 95%] Built target kaccounts_gdrive
[2019-08-08T07:37:56.973Z] make[1]: *** [CMakeFiles/Makefile2:317: src/CMakeFiles/kio_gdrive.dir/all] Error 2
[2019-08-08T07:37:56.973Z] make[1]: *** Waiting for unfinished jobs....
[2019-08-08T07:37:56.973Z] [ 95%] Built target urltest
[2019-08-08T07:37:56.973Z] make: *** [Makefile:141: all] Error 2
[Pipeline] }
[Pipeline] // stage
[Pipeline] }
[2019-08-08T07:37:57.860Z] ERROR: script returned exit code 1
[Pipeline] // catchError
[Pipeline] emailextrecipients
[Pipeline] emailext

Reply | Threaded
Open this post in threaded view
|

KDE CI: Extragear » kio-gdrive » stable-kf5-qt5 SUSEQt5.12 - Build # 3 - Still Failing!

CI System
BUILD FAILURE
Build URL https://build.kde.org/job/Extragear/job/kio-gdrive/job/stable-kf5-qt5%20SUSEQt5.12/3/
Project: stable-kf5-qt5 SUSEQt5.12
Date of build: Wed, 21 Aug 2019 10:45:44 +0000
Build duration: 50 sec and counting

CONSOLE OUTPUT
[...truncated 720 lines...]
[2019-08-21T10:46:34.532Z] | ^~~~~~~~~~~
[2019-08-21T10:46:34.532Z] /home/jenkins/workspace/Extragear/kio-gdrive/stable-kf5-qt5 SUSEQt5.12/src/kio_gdrive.cpp:458:72: error: ���Permissions��� is not a member of ���KGAPI2::Drive::FileFetchJob���
[2019-08-21T10:46:34.532Z] 458 | fileFetchJob.setFields((FileFetchJob::BasicFields & ~FileFetchJob::Permissions)
[2019-08-21T10:46:34.532Z] | ^~~~~~~~~~~
[2019-08-21T10:46:34.532Z] /home/jenkins/workspace/Extragear/kio-gdrive/stable-kf5-qt5 SUSEQt5.12/src/kio_gdrive.cpp:459:45: error: ���Labels��� is not a member of ���KGAPI2::Drive::FileFetchJob���
[2019-08-21T10:46:34.532Z] 459 | | FileFetchJob::Labels
[2019-08-21T10:46:34.532Z] | ^~~~~~
[2019-08-21T10:46:34.532Z] /home/jenkins/workspace/Extragear/kio-gdrive/stable-kf5-qt5 SUSEQt5.12/src/kio_gdrive.cpp:460:45: error: ���ExportLinks��� is not a member of ���KGAPI2::Drive::FileFetchJob���
[2019-08-21T10:46:34.532Z] 460 | | FileFetchJob::ExportLinks
[2019-08-21T10:46:34.532Z] | ^~~~~~~~~~~
[2019-08-21T10:46:34.532Z] /home/jenkins/workspace/Extragear/kio-gdrive/stable-kf5-qt5 SUSEQt5.12/src/kio_gdrive.cpp:461:45: error: ���LastViewedByMeDate��� is not a member of ���KGAPI2::Drive::FileFetchJob���
[2019-08-21T10:46:34.532Z] 461 | | FileFetchJob::LastViewedByMeDate);
[2019-08-21T10:46:34.532Z] | ^~~~~~~~~~~~~~~~~~
[2019-08-21T10:46:34.532Z] /home/jenkins/workspace/Extragear/kio-gdrive/stable-kf5-qt5 SUSEQt5.12/src/kio_gdrive.cpp:477:62: warning: ���void KIO::UDSEntry::insert(uint, const QString&)��� is deprecated [-Wdeprecated-declarations]
[2019-08-21T10:46:34.532Z] 477 | entry.insert(KIO::UDSEntry::UDS_NAME, QStringLiteral("."));
[2019-08-21T10:46:34.532Z] | ^
[2019-08-21T10:46:34.532Z] In file included from /home/jenkins/install-prefix/include/KF5/KIOCore/kio/slavebase.h:24,
[2019-08-21T10:46:34.532Z] from /home/jenkins/install-prefix/include/KF5/KIOCore/KIO/SlaveBase:1,
[2019-08-21T10:46:34.532Z] from /home/jenkins/workspace/Extragear/kio-gdrive/stable-kf5-qt5 SUSEQt5.12/src/kio_gdrive.h:27,
[2019-08-21T10:46:34.532Z] from /home/jenkins/workspace/Extragear/kio-gdrive/stable-kf5-qt5 SUSEQt5.12/src/kio_gdrive.cpp:20:
[2019-08-21T10:46:34.532Z] /home/jenkins/install-prefix/include/KF5/KIOCore/kio/udsentry.h:148:29: note: declared here
[2019-08-21T10:46:34.532Z] 148 | KIOCORE_DEPRECATED void insert(uint field, const QString &value);
[2019-08-21T10:46:34.532Z] | ^~~~~~
[2019-08-21T10:46:34.532Z] /home/jenkins/workspace/Extragear/kio-gdrive/stable-kf5-qt5 SUSEQt5.12/src/kio_gdrive.cpp:478:55: warning: ���void KIO::UDSEntry::insert(uint, long long int)��� is deprecated [-Wdeprecated-declarations]
[2019-08-21T10:46:34.532Z] 478 | entry.insert(KIO::UDSEntry::UDS_FILE_TYPE, S_IFDIR);
[2019-08-21T10:46:34.532Z] | ^
[2019-08-21T10:46:34.532Z] In file included from /home/jenkins/install-prefix/include/KF5/KIOCore/kio/slavebase.h:24,
[2019-08-21T10:46:34.532Z] from /home/jenkins/install-prefix/include/KF5/KIOCore/KIO/SlaveBase:1,
[2019-08-21T10:46:34.532Z] from /home/jenkins/workspace/Extragear/kio-gdrive/stable-kf5-qt5 SUSEQt5.12/src/kio_gdrive.h:27,
[2019-08-21T10:46:34.532Z] from /home/jenkins/workspace/Extragear/kio-gdrive/stable-kf5-qt5 SUSEQt5.12/src/kio_gdrive.cpp:20:
[2019-08-21T10:46:34.532Z] /home/jenkins/install-prefix/include/KF5/KIOCore/kio/udsentry.h:156:29: note: declared here
[2019-08-21T10:46:34.532Z] 156 | KIOCORE_DEPRECATED void insert(uint field, long long l);
[2019-08-21T10:46:34.532Z] | ^~~~~~
[2019-08-21T10:46:34.532Z] /home/jenkins/workspace/Extragear/kio-gdrive/stable-kf5-qt5 SUSEQt5.12/src/kio_gdrive.cpp:479:44: warning: ���void KIO::UDSEntry::insert(uint, long long int)��� is deprecated [-Wdeprecated-declarations]
[2019-08-21T10:46:34.532Z] 479 | entry.insert(KIO::UDSEntry::UDS_SIZE, 0);
[2019-08-21T10:46:34.533Z] | ^
[2019-08-21T10:46:34.533Z] In file included from /home/jenkins/install-prefix/include/KF5/KIOCore/kio/slavebase.h:24,
[2019-08-21T10:46:34.533Z] from /home/jenkins/install-prefix/include/KF5/KIOCore/KIO/SlaveBase:1,
[2019-08-21T10:46:34.533Z] from /home/jenkins/workspace/Extragear/kio-gdrive/stable-kf5-qt5 SUSEQt5.12/src/kio_gdrive.h:27,
[2019-08-21T10:46:34.533Z] from /home/jenkins/workspace/Extragear/kio-gdrive/stable-kf5-qt5 SUSEQt5.12/src/kio_gdrive.cpp:20:
[2019-08-21T10:46:34.533Z] /home/jenkins/install-prefix/include/KF5/KIOCore/kio/udsentry.h:156:29: note: declared here
[2019-08-21T10:46:34.533Z] 156 | KIOCORE_DEPRECATED void insert(uint field, long long l);
[2019-08-21T10:46:34.533Z] | ^~~~~~
[2019-08-21T10:46:34.533Z] /home/jenkins/workspace/Extragear/kio-gdrive/stable-kf5-qt5 SUSEQt5.12/src/kio_gdrive.cpp:480:122: warning: ���void KIO::UDSEntry::insert(uint, long long int)��� is deprecated [-Wdeprecated-declarations]
[2019-08-21T10:46:34.533Z] 480 | entry.insert(KIO::UDSEntry::UDS_ACCESS, S_IRUSR | S_IWUSR | S_IXUSR | S_IRGRP | S_IWGRP | S_IXGRP | S_IROTH | S_IXOTH);
[2019-08-21T10:46:34.533Z] | ^
[2019-08-21T10:46:34.533Z] In file included from /home/jenkins/install-prefix/include/KF5/KIOCore/kio/slavebase.h:24,
[2019-08-21T10:46:34.533Z] from /home/jenkins/install-prefix/include/KF5/KIOCore/KIO/SlaveBase:1,
[2019-08-21T10:46:34.533Z] from /home/jenkins/workspace/Extragear/kio-gdrive/stable-kf5-qt5 SUSEQt5.12/src/kio_gdrive.h:27,
[2019-08-21T10:46:34.533Z] from /home/jenkins/workspace/Extragear/kio-gdrive/stable-kf5-qt5 SUSEQt5.12/src/kio_gdrive.cpp:20:
[2019-08-21T10:46:34.533Z] /home/jenkins/install-prefix/include/KF5/KIOCore/kio/udsentry.h:156:29: note: declared here
[2019-08-21T10:46:34.533Z] 156 | KIOCORE_DEPRECATED void insert(uint field, long long l);
[2019-08-21T10:46:34.533Z] | ^~~~~~
[2019-08-21T10:46:34.533Z] /home/jenkins/workspace/Extragear/kio-gdrive/stable-kf5-qt5 SUSEQt5.12/src/kio_gdrive.cpp: In member function ���virtual void KIOGDrive::get(const QUrl&)���:
[2019-08-21T10:46:34.533Z] /home/jenkins/workspace/Extragear/kio-gdrive/stable-kf5-qt5 SUSEQt5.12/src/kio_gdrive.cpp:610:42: error: ���Id��� is not a member of ���KGAPI2::Drive::FileFetchJob���
[2019-08-21T10:46:34.533Z] 610 | fileFetchJob.setFields(FileFetchJob::Id
[2019-08-21T10:46:34.533Z] | ^~
[2019-08-21T10:46:34.534Z] /home/jenkins/workspace/Extragear/kio-gdrive/stable-kf5-qt5 SUSEQt5.12/src/kio_gdrive.cpp:611:45: error: ���MimeType��� is not a member of ���KGAPI2::Drive::FileFetchJob���
[2019-08-21T10:46:34.534Z] 611 | | FileFetchJob::MimeType
[2019-08-21T10:46:34.534Z] | ^~~~~~~~
[2019-08-21T10:46:34.534Z] /home/jenkins/workspace/Extragear/kio-gdrive/stable-kf5-qt5 SUSEQt5.12/src/kio_gdrive.cpp:612:45: error: ���ExportLinks��� is not a member of ���KGAPI2::Drive::FileFetchJob���
[2019-08-21T10:46:34.534Z] 612 | | FileFetchJob::ExportLinks
[2019-08-21T10:46:34.534Z] | ^~~~~~~~~~~
[2019-08-21T10:46:34.534Z] /home/jenkins/workspace/Extragear/kio-gdrive/stable-kf5-qt5 SUSEQt5.12/src/kio_gdrive.cpp:613:45: error: ���DownloadUrl��� is not a member of ���KGAPI2::Drive::FileFetchJob���
[2019-08-21T10:46:34.534Z] 613 | | FileFetchJob::DownloadUrl);
[2019-08-21T10:46:34.534Z] | ^~~~~~~~~~~
[2019-08-21T10:46:34.534Z] [ 95%] Built target urltest
[2019-08-21T10:46:34.534Z] /home/jenkins/workspace/Extragear/kio-gdrive/stable-kf5-qt5 SUSEQt5.12/src/kio_gdrive.cpp: In member function ���virtual void KIOGDrive::copy(const QUrl&, const QUrl&, int, KIO::JobFlags)���:
[2019-08-21T10:46:34.534Z] /home/jenkins/workspace/Extragear/kio-gdrive/stable-kf5-qt5 SUSEQt5.12/src/kio_gdrive.cpp:869:48: error: ���Id��� is not a member of ���KGAPI2::Drive::FileFetchJob���
[2019-08-21T10:46:34.534Z] 869 | sourceFileFetchJob.setFields(FileFetchJob::Id | FileFetchJob::ModifiedDate |
[2019-08-21T10:46:34.534Z] | ^~
[2019-08-21T10:46:34.534Z] /home/jenkins/workspace/Extragear/kio-gdrive/stable-kf5-qt5 SUSEQt5.12/src/kio_gdrive.cpp:869:67: error: ���ModifiedDate��� is not a member of ���KGAPI2::Drive::FileFetchJob���
[2019-08-21T10:46:34.534Z] 869 | sourceFileFetchJob.setFields(FileFetchJob::Id | FileFetchJob::ModifiedDate |
[2019-08-21T10:46:34.534Z] | ^~~~~~~~~~~~
[2019-08-21T10:46:34.534Z] /home/jenkins/workspace/Extragear/kio-gdrive/stable-kf5-qt5 SUSEQt5.12/src/kio_gdrive.cpp:870:48: error: ���LastViewedByMeDate��� is not a member of ���KGAPI2::Drive::FileFetchJob���
[2019-08-21T10:46:34.534Z] 870 | FileFetchJob::LastViewedByMeDate | FileFetchJob::Description);
[2019-08-21T10:46:34.534Z] | ^~~~~~~~~~~~~~~~~~
[2019-08-21T10:46:34.534Z] /home/jenkins/workspace/Extragear/kio-gdrive/stable-kf5-qt5 SUSEQt5.12/src/kio_gdrive.cpp:870:83: error: ���Description��� is not a member of ���KGAPI2::Drive::FileFetchJob���
[2019-08-21T10:46:34.534Z] 870 | FileFetchJob::LastViewedByMeDate | FileFetchJob::Description);
[2019-08-21T10:46:34.534Z] | ^~~~~~~~~~~
[2019-08-21T10:46:34.534Z] /home/jenkins/workspace/Extragear/kio-gdrive/stable-kf5-qt5 SUSEQt5.12/src/kio_gdrive.cpp: In member function ���virtual void KIOGDrive::mimetype(const QUrl&)���:
[2019-08-21T10:46:34.534Z] /home/jenkins/workspace/Extragear/kio-gdrive/stable-kf5-qt5 SUSEQt5.12/src/kio_gdrive.cpp:1089:42: error: ���Id��� is not a member of ���KGAPI2::Drive::FileFetchJob���
[2019-08-21T10:46:34.534Z] 1089 | fileFetchJob.setFields(FileFetchJob::Id | FileFetchJob::MimeType);
[2019-08-21T10:46:34.534Z] | ^~
[2019-08-21T10:46:34.534Z] /home/jenkins/workspace/Extragear/kio-gdrive/stable-kf5-qt5 SUSEQt5.12/src/kio_gdrive.cpp:1089:61: error: ���MimeType��� is not a member of ���KGAPI2::Drive::FileFetchJob���
[2019-08-21T10:46:34.534Z] 1089 | fileFetchJob.setFields(FileFetchJob::Id | FileFetchJob::MimeType);
[2019-08-21T10:46:34.534Z] | ^~~~~~~~
[2019-08-21T10:46:34.534Z] make[2]: *** [src/CMakeFiles/kio_gdrive.dir/build.make:76: src/CMakeFiles/kio_gdrive.dir/kio_gdrive.cpp.o] Error 1
[2019-08-21T10:46:34.534Z] make[2]: *** Waiting for unfinished jobs....
[2019-08-21T10:46:34.534Z] [ 95%] Built target kaccounts_gdrive
[2019-08-21T10:46:35.099Z] make[1]: *** [CMakeFiles/Makefile2:317: src/CMakeFiles/kio_gdrive.dir/all] Error 2
[2019-08-21T10:46:35.099Z] make: *** [Makefile:141: all] Error 2
[Pipeline] }
[Pipeline] // stage
[Pipeline] }
[2019-08-21T10:46:35.315Z] ERROR: script returned exit code 1
[Pipeline] // catchError
[Pipeline] emailextrecipients
[Pipeline] emailext

Reply | Threaded
Open this post in threaded view
|

KDE CI: Extragear » kio-gdrive » stable-kf5-qt5 SUSEQt5.12 - Build # 4 - Fixed!

CI System
BUILD SUCCESS
Build URL https://build.kde.org/job/Extragear/job/kio-gdrive/job/stable-kf5-qt5%20SUSEQt5.12/4/
Project: stable-kf5-qt5 SUSEQt5.12
Date of build: Sat, 24 Aug 2019 10:10:13 +0000
Build duration: 3 min 12 sec and counting

JUnit Tests
Name: (root) Failed: 0 test(s), Passed: 1 test(s), Skipped: 0 test(s), Total: 1 test(s)
Name: projectroot Failed: 0 test(s), Passed: 1 test(s), Skipped: 0 test(s), Total: 1 test(s)

Cobertura Report
Project Coverage Summary
Name PackagesFilesClassesLinesConditionals
Cobertura Coverage Report67% (2/3)25% (2/8)25% (2/8)9% (78/854)4% (24/580)
Coverage Breakdown by Package
Name FilesClassesLinesConditionals
autotests100% (1/1)100% (1/1)100% (57/57)77% (20/26)
kaccounts0% (0/1)0% (0/1)0% (0/21)0% (0/4)
src17% (1/6)17% (1/6)3% (21/776)1% (4/550)